Target
Glutaminase kidney isoform, mitochondrial
Ligand
BDBM109086
Substrate
Meas. Tech.
ChEMBL_1837822 (CHEMBL4337955)
IC50
30±n/a nM
Citation
 Xu, XKuang, ZHan, JMeng, YLi, LLuan, HXu, PWang, JLuo, CDing, HLi, ZBian, J Development and Characterization of a Fluorescent Probe for GLS1 and the Application for High-Throughput Screening of Allosteric Inhibitors. J Med Chem 62:9642-9657 (2019)  
Target
Name:
Glutaminase kidney isoform, mitochondrial
Synonyms:
GLS GLSK_HUMAN K-glutaminase L-glutamine amidohydrolase
Type:
Protein
Mol. Mass.:
73471.89
Organism:
Homo sapiens (Human)
Description:
O94925
Residue:
669
  
Inhibitor
Name:
BDBM109086
Synonyms:
US10793535, Cmpd ID 727 US9938267, Cmpd ID 670
Type:
Small organic molecule
Emp. Form.:
C26H24F3N7O3S
Mol. Mass.:
571.574
SMILES:
FC(F)(F)Oc1cccc(CC(=O)Nc2ccc(CCCCc3nnc(NC(=O)Cc4ccccn4)s3)nn2)c1
: