Target
Glutaminase kidney isoform, mitochondrial
Ligand
BDBM50509202
Substrate
Meas. Tech.
ChEMBL_1837827 (CHEMBL4337960)
IC50
400±n/a nM
Citation
 Xu, XKuang, ZHan, JMeng, YLi, LLuan, HXu, PWang, JLuo, CDing, HLi, ZBian, J Development and Characterization of a Fluorescent Probe for GLS1 and the Application for High-Throughput Screening of Allosteric Inhibitors. J Med Chem 62:9642-9657 (2019)  
Target
Name:
Glutaminase kidney isoform, mitochondrial
Synonyms:
GLS GLSK_HUMAN K-glutaminase L-glutamine amidohydrolase
Type:
Protein
Mol. Mass.:
73471.89
Organism:
Homo sapiens (Human)
Description:
O94925
Residue:
669
  
Inhibitor
Name:
BDBM50509202
Synonyms:
CHEMBL4447580
Type:
Small organic molecule
Emp. Form.:
C31H34N10O4S
Mol. Mass.:
642.731
SMILES:
COc1ccc(Cn2cc(CCC(=O)Nc3ccc(CCCCc4nnc(NC(=O)Cc5ccccn5)s4)nn3)nn2)cc1OC
: