Target
5-hydroxytryptamine receptor 1A
Ligand
BDBM50063298
Substrate
Meas. Tech.
ChEMBL_1451 (CHEMBL616575)
Ki
76±n/a nM
Citation
 Wustrow, DBelliotti, TGlase, SKesten, SRJohnson, DColbry, NRubin, RBlackburn, AAkunne, HCorbin, ADavis, MDGeorgic, LWhetzel, SZoski, KHeffner, TPugsley, TWise, L Aminopyrimidines with high affinity for both serotonin and dopamine receptors. J Med Chem 41:760-71 (1998)  
Target
Name:
5-hydroxytryptamine receptor 1A
Synonyms:
5-HT-1A 5-HT1A 5-hydroxytryptamine receptor 1A (5HT1A) 5ht1a Htr1a Serotonin 1a (5-HT1a) receptor/Adrenergic receptor alpha-1 | Serotonin receptor 1A
Type:
G Protein-Coupled Receptor (GPCR)
Mol. Mass.:
46445.29
Organism:
Rattus norvegicus (rat)
Description:
Binding assays were performed using rat hippocampal membranes.
Residue:
422
  
Inhibitor
Name:
BDBM50063298
Synonyms:
(4-{2-[4-(2,3-Dichloro-phenyl)-piperazin-1-yl]-ethyl}-cyclohexyl)-pyrimidin-2-yl-amine | CHEMBL350352
Type:
Small organic molecule
Emp. Form.:
C22H29Cl2N5
Mol. Mass.:
434.405
SMILES:
Clc1cccc(N2CCN(CC[C@H]3CC[C@@H](CC3)Nc3ncccn3)CC2)c1Cl
: