Target
5-hydroxytryptamine receptor 1A
Ligand
BDBM50063279
Substrate
Meas. Tech.
ChEMBL_1451 (CHEMBL616575)
Ki
5300±n/a nM
Citation
 Wustrow, DBelliotti, TGlase, SKesten, SRJohnson, DColbry, NRubin, RBlackburn, AAkunne, HCorbin, ADavis, MDGeorgic, LWhetzel, SZoski, KHeffner, TPugsley, TWise, L Aminopyrimidines with high affinity for both serotonin and dopamine receptors. J Med Chem 41:760-71 (1998)  
Target
Name:
5-hydroxytryptamine receptor 1A
Synonyms:
5-HT-1A 5-HT1A 5-hydroxytryptamine receptor 1A (5HT1A) 5ht1a Htr1a Serotonin 1a (5-HT1a) receptor/Adrenergic receptor alpha-1 | Serotonin receptor 1A
Type:
G Protein-Coupled Receptor (GPCR)
Mol. Mass.:
46445.29
Organism:
Rattus norvegicus (rat)
Description:
Binding assays were performed using rat hippocampal membranes.
Residue:
422
  
Inhibitor
Name:
BDBM50063279
Synonyms:
CHEMBL309623 | Cyclohexanecarboxylic acid {4-[2-(4-phenyl-piperazin-1-yl)-ethyl]-cyclohexyl}-amide
Type:
Small organic molecule
Emp. Form.:
C25H39N3O
Mol. Mass.:
397.5967
SMILES:
O=C(N[C@H]1CC[C@H](CCN2CCN(CC2)c2ccccc2)CC1)C1CCCCC1
: