Target
Neurotensin receptor type 1
Ligand
BDBM50509515
Substrate
Meas. Tech.
ChEMBL_1838604 (CHEMBL4338737)
Ki
1.3±n/a nM
Citation
 Keller, MMahuroof, SAHong Yee, VCarpenter, JSchindler, LLittmann, TPegoli, AHübner, HBernhardt, GGmeiner, PHolliday, ND Fluorescence Labeling of Neurotensin(8-13) via Arginine Residues Gives Molecular Tools with High Receptor Affinity. ACS Med Chem Lett 11:16-22 (2020)  
Target
Name:
Neurotensin receptor type 1
Synonyms:
Dopamine receptor D2L/neurotensin receptor NTS1 NTRR Neurotensin receptor 1 | neurotensin receptor type 1
Type:
PROTEIN
Mol. Mass.:
46278.89
Organism:
Homo sapiens (Human)
Description:
ChEMBL_1453811
Residue:
418
  
Inhibitor
Name:
BDBM50509515
Synonyms:
CHEMBL4463399
Type:
Small organic molecule
Emp. Form.:
C72H101F12N15O19
Mol. Mass.:
1708.6423
SMILES:
OC(=O)C(F)(F)F.OC(=O)C(F)(F)F.OC(=O)C(F)(F)F.[O-]C(=O)C(F)(F)F.CC[C@H](C)[C@H](NC(=O)[C@H](Cc1ccc(O)cc1)NC(=O)[C@@H]1CCCN1C(=O)[C@H](CCCNC(N)=N)NC(=O)[C@@H](N)CCCNC(=N)NC(=O)NCCOCCOCC[n+]1c(C)cc(\C=C\C=C\c2ccc(cc2)N(C)C)cc1C)C(=O)N[C@@H](CC(C)C)C(O)=O
: