Target
Neurotensin receptor type 1
Ligand
BDBM50509511
Substrate
Meas. Tech.
ChEMBL_1838598 (CHEMBL4338731)
EC50
0.416869±n/a nM
Citation
 Keller, MMahuroof, SAHong Yee, VCarpenter, JSchindler, LLittmann, TPegoli, AHübner, HBernhardt, GGmeiner, PHolliday, ND Fluorescence Labeling of Neurotensin(8-13) via Arginine Residues Gives Molecular Tools with High Receptor Affinity. ACS Med Chem Lett 11:16-22 (2020)  
Target
Name:
Neurotensin receptor type 1
Synonyms:
Dopamine receptor D2L/neurotensin receptor NTS1 NTRR Neurotensin receptor 1 | neurotensin receptor type 1
Type:
PROTEIN
Mol. Mass.:
46278.89
Organism:
Homo sapiens (Human)
Description:
ChEMBL_1453811
Residue:
418
  
Inhibitor
Name:
BDBM50509511
Synonyms:
CHEMBL4457798
Type:
Small organic molecule
Emp. Form.:
C82H118F6N16O20S2
Mol. Mass.:
1826.03
SMILES:
OC(=O)C(F)(F)F.OC(=O)C(F)(F)F.CC[C@H](C)[C@H](NC(=O)[C@H](Cc1ccc(O)cc1)NC(=O)[C@@H]1CCCN1C(=O)[C@H](CCCNC(N)=N)NC(=O)[C@@H](N)CCCNC(=N)NC(=O)NCCCCNC(=O)CCCCCN1\C(=C\C=C\C=C\C2=[N+](CCCCS([O-])(=O)=O)c3ccccc3C2(C)C)C(C)(C)c2cc(ccc12)S(O)(=O)=O)C(=O)N[C@@H](CC(C)C)C(O)=O
: