Target
Neurotensin receptor type 1
Ligand
BDBM50048908
Substrate
Meas. Tech.
ChEMBL_1838603 (CHEMBL4338736)
Ki
0.128825±n/a nM
Citation
 Keller, MMahuroof, SAHong Yee, VCarpenter, JSchindler, LLittmann, TPegoli, AHübner, HBernhardt, GGmeiner, PHolliday, ND Fluorescence Labeling of Neurotensin(8-13) via Arginine Residues Gives Molecular Tools with High Receptor Affinity. ACS Med Chem Lett 11:16-22 (2020)  
Target
Name:
Neurotensin receptor type 1
Synonyms:
Dopamine receptor D2L/neurotensin receptor NTS1 NTRR Neurotensin receptor 1 | neurotensin receptor type 1
Type:
PROTEIN
Mol. Mass.:
46278.89
Organism:
Homo sapiens (Human)
Description:
ChEMBL_1453811
Residue:
418
  
Inhibitor
Name:
BDBM50048908
Synonyms:
CHEMBL415788
Type:
Small organic molecule
Emp. Form.:
C38H64N12O8
Mol. Mass.:
816.9904
SMILES:
CC[C@H](C)[C@H](NC(=O)[C@H](Cc1ccc(O)cc1)NC(=O)[C@@H]1CCCN1C(=O)[C@H](CCCNC(N)=N)NC(=O)[C@@H](N)CCCNC(N)=N)C(=O)N[C@@H](CC(C)C)C(O)=O
: