Target
Glycylpeptide N-tetradecanoyltransferase
Ligand
BDBM50291976
Substrate
Meas. Tech.
ChEMBL_141299 (CHEMBL748914)
Ki
15300±n/a nM
Citation
 Devadas, BFreeman, SKMcWherter, CAKishore, NSLodge, JKJackson-Machelski, EGordon, JISikorski, JA Novel biologically active nonpeptidic inhibitors of myristoylCoA:protein N-myristoyltransferase. J Med Chem 41:996-1000 (1998)  
Target
Name:
Glycylpeptide N-tetradecanoyltransferase
Synonyms:
2.3.1.97 Myristoyl-CoA:protein N-myristoyltransferase Myristoyl-CoA:protein N-myristoyltransferase (Nmt D112A)) Myristoyl-CoA:protein N-myristoyltransferase (Nmt F115A)) Myristoyl-CoA:protein N-myristoyltransferase (Nmt F240A)) Myristoyl-CoA:protein N-myristoyltransferase (Nmt F339S)) Myristoyl-CoA:protein N-myristoyltransferase (Nmt H227A)) Myristoyl-CoA:protein N-myristoyltransferase (Nmt I352A)) Myristoyl-CoA:protein N-myristoyltransferase (Nmt L451A)) Myristoyl-CoA:protein N-myristoyltransferase (Nmt N175A)) Myristoyl-CoA:protein N-myristoyltransferase (Nmt S241A)) Myristoyl-CoA:protein N-myristoyltransferase (Nmt T211A)) Myristoyl-CoA:protein N-myristoyltransferase (Nmt W232A)) Myristoyl-CoA:protein N-myristoyltransferase (Nmt Y119A)) Myristoyl-CoA:protein N-myristoyltransferase (Nmt Y256A)) Myristoyl-CoA:protein N-myristoyltransferase (Nmt) NMT1 Peptide N-myristoyltransferase | Peptide N-myristoyltransferase 1
Type:
Enzyme
Mol. Mass.:
51875.96
Organism:
Candida albicans (Yeast)
Description:
P30418
Residue:
451
  
Inhibitor
Name:
BDBM50291976
Synonyms:
6-Amino-2-(2-{2-[2-[2-(2-amino-propionylamino)-4-methyl-pentanoylamino]-3-(4-hydroxy-phenyl)-propionylamino]-propionylamino}-3-hydroxy-propionylamino)-hexanoic acid [1-(1-carbamoyl-2-hydroxy-ethylcarbamoyl)-3-methyl-butyl]-amide CHEMBL448105
Type:
Small organic molecule
Emp. Form.:
C39H66N10O11
Mol. Mass.:
851.0017
SMILES:
CC(C)C[C@H](NC(=O)[C@H](C)N)C(=O)N[C@@H](Cc1ccc(O)cc1)C(=O)N[C@@H](C)C(=O)N[C@@H](CO)C(=O)N[C@@H](CCCCN)C(=O)N[C@@H](CC(C)C)C(=O)N[C@@H](CO)C(N)=O
: