Target
Catenin beta-1
Ligand
BDBM50509822
Substrate
Meas. Tech.
ChEMBL_1839365 (CHEMBL4339580)
Ki
6600±n/a nM
Citation
 Wang, ZZhang, MWang, JJi, H Optimization of Peptidomimetics as Selective Inhibitors for the ?-Catenin/T-Cell Factor Protein-Protein Interaction. J Med Chem 62:3617-3635 (2019)  
Target
Name:
Catenin beta-1
Synonyms:
CTNB1_HUMAN CTNNB1
Type:
PROTEIN
Mol. Mass.:
85484.08
Organism:
Homo sapiens (Human)
Description:
ChEMBL_1504364
Residue:
781
  
Inhibitor
Name:
BDBM50509822
Synonyms:
CHEMBL4590084
Type:
Small organic molecule
Emp. Form.:
C38H36ClN5O9
Mol. Mass.:
742.174
SMILES:
COc1cccc(NC(=O)[C@H](CCC(O)=O)NC(=O)[C@@H](CC(O)=O)NC(=O)[C@H](Cc2ccc3ccccc3c2)NC(=O)c2cc3cc(Cl)ccc3[nH]2)c1
: