Target
Catenin beta-1
Ligand
BDBM50509810
Substrate
Meas. Tech.
ChEMBL_1839365 (CHEMBL4339580)
Ki
1500±n/a nM
Citation
 Wang, ZZhang, MWang, JJi, H Optimization of Peptidomimetics as Selective Inhibitors for the ?-Catenin/T-Cell Factor Protein-Protein Interaction. J Med Chem 62:3617-3635 (2019)  
Target
Name:
Catenin beta-1
Synonyms:
CTNB1_HUMAN CTNNB1
Type:
PROTEIN
Mol. Mass.:
85484.08
Organism:
Homo sapiens (Human)
Description:
ChEMBL_1504364
Residue:
781
  
Inhibitor
Name:
BDBM50509810
Synonyms:
CHEMBL4464142
Type:
Small organic molecule
Emp. Form.:
C37H31ClF3N9O7
Mol. Mass.:
806.146
SMILES:
OC(=O)C[C@H](NC(=O)[C@H](Cc1ccc2ccccc2c1)NC(=O)c1cc2cc(Cl)ccc2[nH]1)C(=O)N[C@@H](Cc1nn[nH]n1)C(=O)Nc1ccc(OC(F)(F)F)cc1
: