Target
Catenin beta-1
Ligand
BDBM50509805
Substrate
Meas. Tech.
ChEMBL_1839365 (CHEMBL4339580)
Ki
3700±n/a nM
Citation
 Wang, ZZhang, MWang, JJi, H Optimization of Peptidomimetics as Selective Inhibitors for the ?-Catenin/T-Cell Factor Protein-Protein Interaction. J Med Chem 62:3617-3635 (2019)  
Target
Name:
Catenin beta-1
Synonyms:
CTNB1_HUMAN CTNNB1
Type:
PROTEIN
Mol. Mass.:
85484.08
Organism:
Homo sapiens (Human)
Description:
ChEMBL_1504364
Residue:
781
  
Inhibitor
Name:
BDBM50509805
Synonyms:
CHEMBL4451874
Type:
Small organic molecule
Emp. Form.:
C33H30Cl3N5O8
Mol. Mass.:
730.979
SMILES:
OC(=O)CC[C@H](NC(=O)[C@H](CC(O)=O)NC(=O)[C@H](Cc1ccc(Cl)c(Cl)c1)NC(=O)c1cc2cc(Cl)ccc2[nH]1)C(=O)Nc1ccccc1
: