Target
Cannabinoid receptor 2
Ligand
BDBM50063882
Substrate
Meas. Tech.
ChEMBL_47003 (CHEMBL658972)
Ki
3.1±n/a nM
Citation
 Papahatjis, DPKourouli, TAbadji, VGoutopoulos, AMakriyannis, A Pharmacophoric requirements for cannabinoid side chains: multiple bond and C1'-substituted delta 8-tetrahydrocannabinols. J Med Chem 41:1195-200 (1998)  
Target
Name:
Cannabinoid receptor 2
Synonyms:
CANNABINOID CB2 CB2 Cannabinoid CB2 receptor Cannabinoid receptor 2 mCB2
Type:
Enzyme Catalytic Domain
Mol. Mass.:
38220.43
Organism:
MOUSE
Description:
P47936
Residue:
347
  
Inhibitor
Name:
BDBM50063882
Synonyms:
(6aR,10aR)-3-(hept-1-ynyl)-6,6,9-trimethyl-6a,7,10,10a-tetrahydro-6H-benzo[c]chromen-1-ol CHEMBL279147
Type:
Small organic molecule
Emp. Form.:
C23H30O2
Mol. Mass.:
338.4831
SMILES:
CCCCCC#Cc1cc(O)c2[C@@H]3CC(C)=CC[C@H]3C(C)(C)Oc2c1
: