Target
Cannabinoid receptor 2
Ligand
BDBM50063885
Substrate
Meas. Tech.
ChEMBL_47003 (CHEMBL658972)
Ki
0.52±n/a nM
Citation
 Papahatjis, DPKourouli, TAbadji, VGoutopoulos, AMakriyannis, A Pharmacophoric requirements for cannabinoid side chains: multiple bond and C1'-substituted delta 8-tetrahydrocannabinols. J Med Chem 41:1195-200 (1998)  
Target
Name:
Cannabinoid receptor 2
Synonyms:
CANNABINOID CB2 CB2 Cannabinoid CB2 receptor Cannabinoid receptor 2 mCB2
Type:
Enzyme Catalytic Domain
Mol. Mass.:
38220.43
Organism:
MOUSE
Description:
P47936
Residue:
347
  
Inhibitor
Name:
BDBM50063885
Synonyms:
(-)-2-(6a,7,10,10a-tetrahydro-6,6,9-trimethyl-1-hydroxy-6H-dibenzo[ (6aR,10aR)-3-(2-Hexyl-[1,3]dithiolan-2-yl)-6,6,9-trimethyl-6a,7,10,10a-tetrahydro-6H-benzo[c]chromen-1-ol 3-(2-Hexyl-[1,3]dithiolan-2-yl)-6,6,9-trimethyl-6a,7,10,10a-tetrahydro-6H-benzo[c]chromen-1-ol | CHEMBL476325
Type:
Small organic molecule
Emp. Form.:
C25H36O2S2
Mol. Mass.:
432.682
SMILES:
CCCCCCC1(SCCS1)c1cc(O)c2[C@@H]3CC(C)=CC[C@H]3C(C)(C)Oc2c1
: