Target
Cannabinoid receptor 1
Ligand
BDBM50063886
Substrate
Meas. Tech.
ChEMBL_46813 (CHEMBL659699)
Ki
21.7±n/a nM
Citation
 Papahatjis, DPKourouli, TAbadji, VGoutopoulos, AMakriyannis, A Pharmacophoric requirements for cannabinoid side chains: multiple bond and C1'-substituted delta 8-tetrahydrocannabinols. J Med Chem 41:1195-200 (1998)  
Target
Name:
Cannabinoid receptor 1
Synonyms:
Brain-type cannabinoid receptor CB-R CNR1_RAT Cannabinoid receptor Cnr1 | Skr6
Type:
G Protein-Coupled Receptor (GPCR)
Mol. Mass.:
52856.55
Organism:
Rattus norvegicus (rat)
Description:
P20272
Residue:
473
  
Inhibitor
Name:
BDBM50063886
Synonyms:
1-((6aR,10aR)-1-Hydroxy-6,6,9-trimethyl-6a,7,10,10a-tetrahydro-6H-benzo[c]chromen-3-yl)-heptan-1-one CHEMBL418555
Type:
Small organic molecule
Emp. Form.:
C23H32O3
Mol. Mass.:
356.4984
SMILES:
CCCCCCC(=O)c1cc(O)c2[C@@H]3CC(C)=CC[C@H]3C(C)(C)Oc2c1
: