Target
Matrix metalloproteinase-14
Ligand
BDBM50063918
Substrate
Meas. Tech.
ChEMBL_217867 (CHEMBL822190)
IC50
3±n/a nM
Citation
 Yamamoto, MTsujishita, HHori, NOhishi, YInoue, SIkeda, SOkada, Y Inhibition of membrane-type 1 matrix metalloproteinase by hydroxamate inhibitors: an examination of the subsite pocket. J Med Chem 41:1209-17 (1998)  
Target
Name:
Matrix metalloproteinase-14
Synonyms:
MMP-14 MMP14 MT-MMP 1 MT1MMP Matrix Metalloproteinase-14 (MMP-14) Matrix metalloproteinase-14 Membrane-type matrix metalloproteinase 1 | Membrane-type-1 matrix metalloproteinase
Type:
Protein
Mol. Mass.:
65900.19
Organism:
Homo sapiens (Human)
Description:
P50281
Residue:
582
  
Inhibitor
Name:
BDBM50063918
Synonyms:
(2R,3S)-N*4*-Hydroxy-2-isobutyl-N*1*-((S)-1-methylcarbamoyl-2-phenyl-ethyl)-3-(thiophen-2-ylsulfanylmethyl)-succinamide 4-Methyl-2-[1-methyl-2-(thiophen-2-ylsulfanyl)-ethyl]-pentanoic acid (1-methylcarbamoyl-2-phenyl-ethyl)-amide BB-94 N*4*-Hydroxy-2-isobutyl-N*1*-(1-methylcarbamoyl-2-phenyl-ethyl)-3-(thiophen-2-ylsulfanylmethyl)-succinamide
Type:
Small organic molecule
Emp. Form.:
C23H31N3O4S2
Mol. Mass.:
477.64
SMILES:
CNC(=O)[C@H](Cc1ccccc1)NC(=O)[C@H](CC(C)C)[C@H](CSc1cccs1)C(=O)NO
: