Target
Reverse transcriptase/RNaseH
Ligand
BDBM50064009
Substrate
Meas. Tech.
ChEMBL_196510 (CHEMBL798324)
IC50
55±n/a nM
Citation
 Wishka, DGGraber, DRKopta, LAOlmsted, RAFriis, JMHosley, JDAdams, WJSeest, EPCastle, TMDolak, LAKeiser, BJYagi, YJeganathan, ASchlachter, STMurphy, MJCleek, GJNugent, RAPoppe, SMSwaney, SMHan, FWatt, WWhite, WLPoel, TJThomas, RCMorris, J (-)-6-Chloro-2-[(1-furo[2, 3-c]pyridin-5-ylethyl)thio]-4-pyrimidinamine, PNU-142721, a new broad spectrum HIV-1 non-nucleoside reverse transcriptase inhibitor. J Med Chem 41:1357-60 (1998)  
Target
Name:
Reverse transcriptase/RNaseH
Synonyms:
HIV-1 Reverse Transcriptase RNase H Reverse transcriptase/RNaseH
Type:
PROTEIN
Mol. Mass.:
65229.15
Organism:
Human immunodeficiency virus 1
Description:
ChEMBL_1473730
Residue:
566
  
Inhibitor
Name:
BDBM50064009
Synonyms:
6-Chloro-2-(1-furo[2,3-c]pyridin-5-yl-ethylsulfanyl)-pyrimidin-4-ylamine | CHEMBL280752
Type:
Small organic molecule
Emp. Form.:
C13H11ClN4OS
Mol. Mass.:
306.771
SMILES:
CC(Sc1nc(N)cc(Cl)n1)c1cc2ccoc2cn1
: