Target
Bifunctional dihydrofolate reductase-thymidylate synthase
Ligand
BDBM18268
Substrate
Meas. Tech.
ChEMBL_53476 (CHEMBL665601)
IC50
10±n/a nM
Citation
 Gangjee, AElzein, EQueener, SFMcGuire, JJ Synthesis and biological activities of tricyclic conformationally restricted tetrahydropyrido annulated furo[2,3-d]pyrimidines as inhibitors of dihydrofolate reductases. J Med Chem 41:1409-16 (1998)  
Target
Name:
Bifunctional dihydrofolate reductase-thymidylate synthase
Synonyms:
DHFR-TS Dihydrofolate reductase Dihydrofolate reductase; T. gondii vs rat
Type:
Enzyme
Mol. Mass.:
68757.49
Organism:
Toxoplasma gondii
Description:
Q07422
Residue:
610
  
Inhibitor
Name:
BDBM18268
Synonyms:
5-methyl-6-{[(3,4,5-trimethoxyphenyl)amino]methyl}quinazoline-2,4-diamine TMQ US11111252, Compound TMQ | US11530198, Example Trimetrexate
Type:
Small organic molecule
Emp. Form.:
C19H23N5O3
Mol. Mass.:
369.4176
SMILES:
COc1cc(NCc2ccc3nc(N)nc(N)c3c2C)cc(OC)c1OC
: