Target
Protein kinase C delta type
Ligand
BDBM50064095
Substrate
Meas. Tech.
ChEMBL_160791 (CHEMBL766602)
Ki
5100±n/a nM
Citation
 Endo, YTakehana, SOhno, MDriedger, PEStabel, SMizutani, MYTomioka, NItai, AShudo, K Clarification of the binding mode of teleocidin and benzolactams to the Cys2 domain of protein kinase Cdelta by synthesis of hydrophobically modified, teleocidin-mimicking benzolactams and computational docking simulation. J Med Chem 41:1476-96 (1998)  
Target
Name:
Protein kinase C delta type
Synonyms:
KPCD_HUMAN PKCD Protein Kinase C- delta nPKC-delta
Type:
Enzyme
Mol. Mass.:
77516.79
Organism:
Homo sapiens (Human)
Description:
The recombinant human PKC enzymes were produced using a baculovirus expression system in SF9 cells
Residue:
676
  
Inhibitor
Name:
BDBM50064095
Synonyms:
(7S,10S)-10-Hydroxymethyl-7-isopropyl-1,1,4,4,6-pentamethyl-2,3,4,6,7,9,10,11-octahydro-1H-6,9-diaza-cycloocta[b]naphthalen-8-one | CHEMBL35696
Type:
Small organic molecule
Emp. Form.:
C23H36N2O2
Mol. Mass.:
372.5441
SMILES:
CC(C)[C@@H]1N(C)c2cc3c(cc2C[C@@H](CO)NC1=O)C(C)(C)CCC3(C)C
: