Target
Acid-sensing ion channel 2
Ligand
BDBM50000999
Substrate
Meas. Tech.
ChEMBL_1840000 (CHEMBL4340215)
IC50
169000±n/a nM
Citation
 Bencheva, LIDe Matteo, MFerrante, LFerrara, MPrandi, ARandazzo, PRonzoni, SSinisi, RSeneci, PSumma, VGallo, MVeneziano, MCellucci, AMazzocchi, NMenegon, ADi Fabio, R Identification of Isoform 2 Acid-Sensing Ion Channel Inhibitors as Tool Compounds for Target Validation Studies in CNS. ACS Med Chem Lett 10:627-632 (2019)  
Target
Name:
Acid-sensing ion channel 2
Synonyms:
ASIC2_MOUSE Acid-sensing ion channel 2 Amiloride-sensitive cation channel 1, neuronal BNC1 Brain sodium channel 1
Type:
PROTEIN
Mol. Mass.:
57721.82
Organism:
Mus musculus
Description:
ChEMBL_119368
Residue:
512
  
Inhibitor
Name:
BDBM50000999
Synonyms:
CHEBI:81724 | DIMINAZENE
Type:
Small organic molecule
Emp. Form.:
C14H15N7
Mol. Mass.:
281.3158
SMILES:
NC(=N)c1ccc(N\N=N\c2ccc(cc2)C(N)=N)cc1
: