Target
Retinoic acid receptor RXR-gamma
Ligand
BDBM31883
Substrate
Meas. Tech.
ChEMBL_196647 (CHEMBL800760)
EC50
6±n/a nM
Citation
 Muccio, DDBrouillette, WJBreitman, TRTaimi, MEmanuel, PDZhang, XChen, GSani, BPVenepally, PReddy, LAlam, MSimpson-Herren, LHill, DL Conformationally defined retinoic acid analogues. 4. Potential new agents for acute promyelocytic and juvenile myelomonocytic leukemias. J Med Chem 41:1679-87 (1998)  
Target
Name:
Retinoic acid receptor RXR-gamma
Synonyms:
Nr2b3 Retinoid X receptor gamma | Rxrg
Type:
PROTEIN
Mol. Mass.:
50900.28
Organism:
Mus musculus
Description:
ChEMBL_196589
Residue:
463
  
Inhibitor
Name:
BDBM31883
Synonyms:
9-cis-retinoic acid (9cRA) AT-RA CHEMBL38 SMR000058245 Vitamin A acid [3H]Retinoic acid [3H]tretinoin cid_444795
Type:
radiolabeled ligand
Emp. Form.:
C20H28O2
Mol. Mass.:
300.4351
SMILES:
C\C(\C=C\C1=C(C)CCCC1(C)C)=C/C=C/C(/C)=C/C(O)=O
: