Target
All-trans-retinol dehydrogenase [NAD(+)] ADH4
Ligand
BDBM50064267
Substrate
Meas. Tech.
ChEMBL_31171 (CHEMBL641136)
Ki
280000±n/a nM
Citation
 Schindler, JFBerst, KBPlapp, BV Inhibition of human alcohol dehydrogenases by formamides. J Med Chem 41:1696-701 (1998)  
Target
Name:
All-trans-retinol dehydrogenase [NAD(+)] ADH4
Synonyms:
ADH2 ADH4_HUMAN Alcohol dehydrogenase class II
Type:
PROTEIN
Mol. Mass.:
40228.36
Organism:
Homo sapiens (Human)
Description:
ChEMBL_31171
Residue:
380
  
Inhibitor
Name:
BDBM50064267
Synonyms:
CHEMBL297125 | N,N-Dicyclobutyl-formamide
Type:
Small organic molecule
Emp. Form.:
C9H15NO
Mol. Mass.:
153.2215
SMILES:
O=CN(C1CCC1)C1CCC1
: