Target
All-trans-retinol dehydrogenase [NAD(+)] ADH1B
Ligand
BDBM50064279
Substrate
Meas. Tech.
ChEMBL_31169 (CHEMBL641134)
Ki
26000±n/a nM
Citation
 Schindler, JFBerst, KBPlapp, BV Inhibition of human alcohol dehydrogenases by formamides. J Med Chem 41:1696-701 (1998)  
Target
Name:
All-trans-retinol dehydrogenase [NAD(+)] ADH1B
Synonyms:
ADH1B ADH2 Alcohol dehydrogenase beta chain
Type:
PROTEIN
Mol. Mass.:
39864.68
Organism:
Homo sapiens (Human)
Description:
ChEMBL_31169
Residue:
375
  
Inhibitor
Name:
BDBM50064279
Synonyms:
CHEMBL299094 | N-Isobutyl-formamide
Type:
Small organic molecule
Emp. Form.:
C5H11NO
Mol. Mass.:
101.1469
SMILES:
CC(C)CNC=O
: