Target
Proto-oncogene tyrosine-protein kinase Src
Ligand
BDBM3474
Substrate
Meas. Tech.
ChEMBL_216860 (CHEMBL816697)
IC50
31±n/a nM
Citation
 Trumpp-Kallmeyer, SRubin, JRHumblet, CHamby, JMHollis Showalter, HD Development of a binding model to protein tyrosine kinases for substituted pyrido[2,3-d]pyrimidine inhibitors. J Med Chem 41:1752-63 (1998)  
Target
Name:
Proto-oncogene tyrosine-protein kinase Src
Synonyms:
Proto-oncogene c-Src SRC_CHICK c-Src p60c-src | pp60c-src
Type:
Tyr protein kinase
Mol. Mass.:
60015.36
Organism:
Gallus gallus (Chicken)
Description:
P00523
Residue:
533
  
Inhibitor
Name:
BDBM3474
Synonyms:
1-cyclohexyl-3-[6-(2,6-dichlorophenyl)-2-{[3-(4-methylpiperazin-1-yl)propyl]amino}pyrido[2,3-d]pyrimidin-7-yl]urea CHEMBL51028
Type:
Small organic molecule
Emp. Form.:
C28H36Cl2N8O
Mol. Mass.:
571.544
SMILES:
CN1CCN(CCCNc2ncc3cc(c(NC(=O)NC4CCCCC4)nc3n2)-c2c(Cl)cccc2Cl)CC1
: