Target
Proto-oncogene tyrosine-protein kinase Src
Ligand
BDBM3443
Substrate
Meas. Tech.
ChEMBL_216860 (CHEMBL816697)
IC50
>50000±n/a nM
Citation
 Trumpp-Kallmeyer, SRubin, JRHumblet, CHamby, JMHollis Showalter, HD Development of a binding model to protein tyrosine kinases for substituted pyrido[2,3-d]pyrimidine inhibitors. J Med Chem 41:1752-63 (1998)  
Target
Name:
Proto-oncogene tyrosine-protein kinase Src
Synonyms:
Proto-oncogene c-Src SRC_CHICK c-Src p60c-src | pp60c-src
Type:
Tyr protein kinase
Mol. Mass.:
60015.36
Organism:
Gallus gallus (Chicken)
Description:
P00523
Residue:
533
  
Inhibitor
Name:
BDBM3443
Synonyms:
1-[2-amino-6-(3,5-dimethoxyphenyl)pyrido[2,3-d]pyrimidin-7-yl]-3-tert-butylurea CHEMBL299763 PD166866
Type:
Small organic molecule
Emp. Form.:
C20H24N6O3
Mol. Mass.:
396.443
SMILES:
COc1cc(OC)cc(c1)-c1cc2cnc(N)nc2nc1NC(=O)NC(C)(C)C
: