Target
5-hydroxytryptamine receptor 2A
Ligand
BDBM50064587
Substrate
Meas. Tech.
ChEMBL_2256 (CHEMBL617199)
IC50
300±n/a nM
Citation
 Taverne, TDiouf, ODepreux, PPoupaert, JHLesieur, DGuardiola-Lemaître, BRenard, PRettori, MCCaignard, DHPfeiffer, B Novel benzothiazolin-2-one and benzoxazin-3-one arylpiperazine derivatives with mixed 5HT1A/D2 affinity as potential atypical antipsychotics. J Med Chem 41:2010-8 (1998)  
Target
Name:
5-hydroxytryptamine receptor 2A
Synonyms:
5-HT2A 5HTR2A Serotonin 2a (5-HT2a) receptor
Type:
Enzyme Catalytic Domain
Mol. Mass.:
52578.24
Organism:
BOVINE
Description:
5-HT2A HTR2A BOVINE::Q75Z89
Residue:
470
  
Inhibitor
Name:
BDBM50064587
Synonyms:
6-{2-[4-(2-Methoxy-phenyl)-piperazin-1-yl]-ethyl}-3H-benzothiazol-2-one | CHEMBL60885
Type:
Small organic molecule
Emp. Form.:
C20H23N3O2S
Mol. Mass.:
369.481
SMILES:
COc1ccccc1N1CCN(CCc2ccc3[nH]c(=O)sc3c2)CC1
: