Target
5-hydroxytryptamine receptor 1A
Ligand
BDBM50064581
Substrate
Meas. Tech.
ChEMBL_561 (CHEMBL615581)
IC50
2±n/a nM
Citation
 Taverne, TDiouf, ODepreux, PPoupaert, JHLesieur, DGuardiola-Lemaître, BRenard, PRettori, MCCaignard, DHPfeiffer, B Novel benzothiazolin-2-one and benzoxazin-3-one arylpiperazine derivatives with mixed 5HT1A/D2 affinity as potential atypical antipsychotics. J Med Chem 41:2010-8 (1998)  
Target
Name:
5-hydroxytryptamine receptor 1A
Synonyms:
5-HT-1A 5-hydroxytryptamine receptor 1A (5-HT-1A) ADRB2RL1 Dopamine D2 receptor and serotonin 1a receptor HTR1A | Serotonin receptor 1A
Type:
Mol. Mass.:
46122.49
Organism:
Homo sapiens (Human)
Description:
Residue:
422
  
Inhibitor
Name:
BDBM50064581
Synonyms:
3-Methyl-6-{4-[4-(3-trifluoromethyl-phenyl)-piperazin-1-yl]-butyl}-3H-benzothiazol-2-one | CHEMBL61818
Type:
Small organic molecule
Emp. Form.:
C23H26F3N3OS
Mol. Mass.:
449.532
SMILES:
Cn1c2ccc(CCCCN3CCN(CC3)c3cccc(c3)C(F)(F)F)cc2sc1=O
: