Target
D(2) dopamine receptor
Ligand
BDBM50064589
Substrate
Meas. Tech.
ChEMBL_59315 (CHEMBL670209)
IC50
10±n/a nM
Citation
 Taverne, TDiouf, ODepreux, PPoupaert, JHLesieur, DGuardiola-Lemaître, BRenard, PRettori, MCCaignard, DHPfeiffer, B Novel benzothiazolin-2-one and benzoxazin-3-one arylpiperazine derivatives with mixed 5HT1A/D2 affinity as potential atypical antipsychotics. J Med Chem 41:2010-8 (1998)  
Target
Name:
D(2) dopamine receptor
Synonyms:
DOPAMINE D2 DRD2_BOVIN | Dopamine D2 receptor
Type:
Enzyme Catalytic Domain
Mol. Mass.:
50698.79
Organism:
BOVINE
Description:
P20288
Residue:
444
  
Inhibitor
Name:
BDBM50064589
Synonyms:
6-{4-[4-(2-Methoxy-phenyl)-piperazin-1-yl]-butyl}-3-methyl-3H-benzothiazol-2-one | CHEMBL61819
Type:
Small organic molecule
Emp. Form.:
C23H29N3O2S
Mol. Mass.:
411.56
SMILES:
COc1ccccc1N1CCN(CCCCc2ccc3n(C)c(=O)sc3c2)CC1
: