Target
5-hydroxytryptamine receptor 1A
Ligand
BDBM50064575
Substrate
Meas. Tech.
ChEMBL_561 (CHEMBL615581)
IC50
3±n/a nM
Citation
 Taverne, TDiouf, ODepreux, PPoupaert, JHLesieur, DGuardiola-Lemaître, BRenard, PRettori, MCCaignard, DHPfeiffer, B Novel benzothiazolin-2-one and benzoxazin-3-one arylpiperazine derivatives with mixed 5HT1A/D2 affinity as potential atypical antipsychotics. J Med Chem 41:2010-8 (1998)  
Target
Name:
5-hydroxytryptamine receptor 1A
Synonyms:
5-HT-1A 5-hydroxytryptamine receptor 1A (5-HT-1A) ADRB2RL1 Dopamine D2 receptor and serotonin 1a receptor HTR1A | Serotonin receptor 1A
Type:
Mol. Mass.:
46122.49
Organism:
Homo sapiens (Human)
Description:
Residue:
422
  
Inhibitor
Name:
BDBM50064575
Synonyms:
6-[2-(4-Phenyl-piperazin-1-yl)-ethyl]-3H-benzothiazol-2-one | CHEMBL59637
Type:
Small organic molecule
Emp. Form.:
C19H21N3OS
Mol. Mass.:
339.455
SMILES:
O=c1[nH]c2ccc(CCN3CCN(CC3)c3ccccc3)cc2s1
: