Target
5-hydroxytryptamine receptor 2C
Ligand
BDBM50064574
Substrate
Meas. Tech.
ChEMBL_2787 (CHEMBL617856)
IC50
360±n/a nM
Citation
 Taverne, TDiouf, ODepreux, PPoupaert, JHLesieur, DGuardiola-Lemaître, BRenard, PRettori, MCCaignard, DHPfeiffer, B Novel benzothiazolin-2-one and benzoxazin-3-one arylpiperazine derivatives with mixed 5HT1A/D2 affinity as potential atypical antipsychotics. J Med Chem 41:2010-8 (1998)  
Target
Name:
5-hydroxytryptamine receptor 2C
Synonyms:
5-HT-2C 5-HT2C-INI 5-HTR2C 5-hydroxytryptamine receptor 2C (5-HT-2C) 5HT-1C HTR1C Serotonin (5-HT3) receptor Serotonin Receptor 2C
Type:
G Protein-Coupled Receptor (GPCR)
Mol. Mass.:
51836.79
Organism:
Homo sapiens (Human)
Description:
P28335
Residue:
458
  
Inhibitor
Name:
BDBM50064574
Synonyms:
4-Methyl-7-{2-[4-(3-trifluoromethyl-phenyl)-piperazin-1-yl]-ethyl}-4H-benzo[1,4]oxazin-3-one | CHEMBL60047
Type:
Small organic molecule
Emp. Form.:
C22H24F3N3O2
Mol. Mass.:
419.4401
SMILES:
CN1C(=O)COc2cc(CCN3CCN(CC3)c3cccc(c3)C(F)(F)F)ccc12
: