Target
Gag-Pol polyprotein [489-587]
Ligand
BDBM50065079
Substrate
Meas. Tech.
ChEMBL_157733 (CHEMBL765171)
Ki
0.027±n/a nM
Citation
 De Lucca, GVKim, UTLiang, JCordova, BKlabe, RMGarber, SBacheler, LTLam, GNWright, MRLogue, KAErickson-Viitanen, SKo, SSTrainor, GL Nonsymmetric P2/P2' cyclic urea HIV protease inhibitors. Structure-activity relationship, bioavailability, and resistance profile of monoindazole-substituted P2 analogues. J Med Chem 41:2411-23 (1998)  
Target
Name:
Gag-Pol polyprotein [489-587]
Synonyms:
Human immunodeficiency virus type 1 protease Pol polyprotein | gag-pol
Type:
Enzyme Subunit
Mol. Mass.:
10781.16
Organism:
Human immunodeficiency virus type 1
Description:
P04585[489-587]
Residue:
99
  
Inhibitor
Name:
BDBM50065079
Synonyms:
(4R,5S,6S,7R)-4,7-Dibenzyl-1-(4-fluoro-3-methylamino-benzyl)-5,6-dihydroxy-3-(1H-indazol-5-ylmethyl)-[1,3]diazepan-2-one | CHEMBL78504
Type:
Small organic molecule
Emp. Form.:
C35H36FN5O3
Mol. Mass.:
593.6904
SMILES:
CNc1cc(CN2[C@H](Cc3ccccc3)[C@H](O)[C@@H](O)[C@@H](Cc3ccccc3)N(Cc3ccc4[nH]ncc4c3)C2=O)ccc1F
: