Target
Beta-secretase 1
Ligand
BDBM400331
Substrate
Meas. Tech.
ChEMBL_1842179 (CHEMBL4342606)
IC50
0.482000±n/a nM
Citation
 Hsiao, CCRombouts, FGijsen, HJM New evolutions in the BACE1 inhibitor field from 2014 to 2018. Bioorg Med Chem Lett 29:761-777 (2019)  
Target
Name:
Beta-secretase 1
Synonyms:
ASP2 Aspartyl protease 2 BACE1 Beta-secretase (BACE) Beta-secretase 1 (BACE 1) Beta-secretase 1 (BACE1) Beta-site amyloid precursor protein cleaving enzyme 1 Memapsin-2 beta-Secretase (BACE-1) | beta-Secretase (BACE1)
Type:
Protein
Mol. Mass.:
55755.10
Organism:
Homo sapiens (Human)
Description:
P56817
Residue:
501
  
Inhibitor
Name:
BDBM400331
Synonyms:
US9999624, 2
Type:
Small organic molecule
Emp. Form.:
C22H21FN8O2S
Mol. Mass.:
480.518
SMILES:
COc1cnc(cn1)C(=O)Nc1cccc(c1)[C@]12CN(C[C@H]1CSC(N)=N2)c1ncc(F)cn1
: