Target
Carboxylic ester hydrolase
Ligand
BDBM8979
Substrate
Meas. Tech.
ChEMBL_1842269 (CHEMBL4342696)
IC50
76±n/a nM
Citation
 Mishra, PKumar, APanda, G Anti-cholinesterase hybrids as multi-target-directed ligands against Alzheimer's disease (1998-2018). Bioorg Med Chem 27:895-930 (2019)  
Target
Name:
Carboxylic ester hydrolase
Synonyms:
Acetylcholinesterase and butyrylcholinesterase (AChE and BChE) Butyrylcholinesterase (BuChE) | butyrylcholinesterase precursor
Type:
Enzyme
Mol. Mass.:
67776.22
Organism:
Rattus norvegicus (rat)
Description:
Residue:
597
  
Inhibitor
Name:
BDBM8979
Synonyms:
CHEMBL486901 tacrine-E2020 analog 3
Type:
Small organic molecule
Emp. Form.:
C29H36N4O
Mol. Mass.:
456.6223
SMILES:
O=C(CNc1c2CCCCc2nc2ccccc12)NCCC1CCN(Cc2ccccc2)CC1
: