Target
Acetylcholinesterase
Ligand
BDBM9017
Substrate
Meas. Tech.
ChEMBL_1842270 (CHEMBL4342697)
IC50
0.000±n/a nM
Citation
 Mishra, PKumar, APanda, G Anti-cholinesterase hybrids as multi-target-directed ligands against Alzheimer's disease (1998-2018). Bioorg Med Chem 27:895-930 (2019)  
Target
Name:
Acetylcholinesterase
Synonyms:
ACES_HUMAN Acetylcholinesterase (AChE) | Acetylcholinesterase (human AChE)
Type:
Enzyme
Mol. Mass.:
67792.70
Organism:
Homo sapiens (Human)
Description:
P22303
Residue:
614
  
Inhibitor
Name:
BDBM9017
Synonyms:
7-(6,8-Dichloro-1,2,3,4-tetrahydro-acridin-9-ylamino)-heptanoic acid [2-(5-methoxy-1Hindol-3-yl)-ethyl]-amide Tacrine-Melatonin Hybrid 10b
Type:
Small organic molecule
Emp. Form.:
C31H36Cl2N4O2
Mol. Mass.:
567.549
SMILES:
COc1ccc2[nH]cc(CCNC(=O)CCCCCCNc3c4CCCCc4nc4cc(Cl)cc(Cl)c34)c2c1
: