Target
Platelet-derived growth factor receptor beta
Ligand
BDBM50065271
Substrate
Meas. Tech.
ChEMBL_158520 (CHEMBL768947)
IC50
17500±n/a nM
Citation
 Sun, LTran, NTang, FApp, HHirth, PMcMahon, GTang, C Synthesis and biological evaluations of 3-substituted indolin-2-ones: a novel class of tyrosine kinase inhibitors that exhibit selectivity toward particular receptor tyrosine kinases. J Med Chem 41:2588-603 (1998)  
Target
Name:
Platelet-derived growth factor receptor beta
Synonyms:
Beta-type platelet-derived growth factor receptor CD140b antigen PDGF Receptor Substrate PDGFR PDGFR-1 PDGFRB PGFRB_HUMAN Platelet-derived growth factor receptor 1 Platelet-derived growth factor receptor beta (PDGFR-beta) Platelet-derived growth factor receptor beta (PDGFRbeta) | VHL/PDGFRB
Type:
Enzyme
Mol. Mass.:
123922.25
Organism:
Homo sapiens (Human)
Description:
P09619
Residue:
1106
  
Inhibitor
Name:
BDBM50065271
Synonyms:
3-(4-hydroxy-3,5-diisopropylbenzylidene)indolin-2-one CHEMBL85021 | ST-280
Type:
Small organic molecule
Emp. Form.:
C21H23NO2
Mol. Mass.:
321.4128
SMILES:
CC(C)c1cc(\C=C2/C(=O)Nc3ccccc23)cc(C(C)C)c1O
: