Target
Genome polyprotein
Ligand
BDBM50065591
Substrate
Meas. Tech.
ChEMBL_160898 (CHEMBL771794)
Ki
40±n/a nM
Citation
 Webber, SEOkano, KLittle, TLReich, SHXin, YFuhrman, SAMatthews, DALove, RAHendrickson, TFPatick, AKMeador, JWFerre, RABrown, ELFord, CEBinford, SLWorland, ST Tripeptide aldehyde inhibitors of human rhinovirus 3C protease: design, synthesis, biological evaluation, and cocrystal structure solution of P1 glutamine isosteric replacements. J Med Chem 41:2786-805 (1998)  
Target
Name:
Genome polyprotein
Synonyms:
Human rhinovirus A protease | Human rhinovirus B 3A protease
Type:
PROTEIN
Mol. Mass.:
44361.04
Organism:
Human rhinovirus B
Description:
ChEMBL_158953
Residue:
401
  
Inhibitor
Name:
BDBM50065591
Synonyms:
((S)-1-{(S)-1-[(S)-1-Formyl-3-(trityl-carbamoyl)-propylcarbamoyl]-2-phenyl-ethylcarbamoyl}-3-methyl-butyl)-carbamic acid benzyl ester | CHEMBL329857
Type:
Small organic molecule
Emp. Form.:
C47H50N4O6
Mol. Mass.:
766.9231
SMILES:
CC(C)C[C@H](NC(=O)OCc1ccccc1)C(=O)N[C@@H](Cc1ccccc1)C(=O)N[C@@H](CCC(=O)NC(c1ccccc1)(c1ccccc1)c1ccccc1)C=O
: