Target
Aldehyde dehydrogenase 1A1
Ligand
BDBM11365
Substrate
Meas. Tech.
ChEMBL_31302 (CHEMBL643983)
IC50
180000±n/a nM
Citation
 Conway, TTDeMaster, EGLee, MJNagasawa, HT Prodrugs of nitroxyl and nitrosobenzene as cascade latentiated inhibitors of aldehyde dehydrogenase. J Med Chem 41:2903-9 (1998)  
Target
Name:
Aldehyde dehydrogenase 1A1
Synonyms:
AL1A1_RAT Aldh1a1
Type:
PROTEIN
Mol. Mass.:
54465.59
Organism:
Rattus norvegicus
Description:
ChEMBL_31158
Residue:
501
  
Inhibitor
Name:
BDBM11365
Synonyms:
CHEMBL98328 N-hydroxymethanesulfonamide
Type:
Small organic molecule
Emp. Form.:
CH5NO3S
Mol. Mass.:
111.12
SMILES:
CS(=O)(=O)NO
: