Target
Acetyl-CoA carboxylase 2
Ligand
BDBM50069756
Substrate
Meas. Tech.
ChEMBL_1843857 (CHEMBL4344284)
IC50
2.6±n/a nM
Citation
 Romero, FAJones, CTXu, YFenaux, MHalcomb, RL The Race to Bash NASH: Emerging Targets and Drug Development in a Complex Liver Disease. J Med Chem 63:5031-5073 (2020)  
Target
Name:
Acetyl-CoA carboxylase 2
Synonyms:
ACACB ACC-beta ACCB Acetyl-CoA carboxylase 2 Acetyl-CoA carboxylase 2 (ACC2)
Type:
Protein
Mol. Mass.:
276535.21
Organism:
Homo sapiens (Human)
Description:
O00763
Residue:
2458
  
Inhibitor
Name:
BDBM50069756
Synonyms:
CHEMBL3407547 ND-630 US10995099, Example 38 | US11186587, Example ND-630
Type:
Small organic molecule
Emp. Form.:
C28H31N3O8S
Mol. Mass.:
569.626
SMILES:
COc1ccccc1[C@H](Cn1c2sc(c(C)c2c(=O)n(c1=O)C(C)(C)C(O)=O)-c1ncco1)OC1CCOCC1
: