Target
Melanocyte-stimulating hormone receptor
Ligand
BDBM50017181
Substrate
Meas. Tech.
ChEMBL_1844472 (CHEMBL4344899)
EC50
0.012000±n/a nM
Citation
 Winget, MDEricson, MDFreeman, KTHaskell-Luevano, C Single Nucleotide Polymorphisms in the Melanocortin His-Phe-Arg-Trp Sequences Decrease Tetrapeptide Potency and Efficacy. ACS Med Chem Lett 11:272-277 (2020)  
Target
Name:
Melanocyte-stimulating hormone receptor
Synonyms:
MC1-R Mc1r Melanocyte-stimulating hormone receptor | Msh-r
Type:
PROTEIN
Mol. Mass.:
35238.60
Organism:
Mus musculus
Description:
ChEMBL_1498846
Residue:
315
  
Inhibitor
Name:
BDBM50017181
Synonyms:
CHEMBL441738
Type:
Small organic molecule
Emp. Form.:
C78H111N21O19
Mol. Mass.:
1646.8452
SMILES:
CCCC[C@H](NC(=O)[C@H](CO)NC(=O)[C@H](Cc1ccc(O)cc1)NC(=O)[C@H](CO)NC(C)=O)C(=O)N[C@@H](CCC(O)=O)C(=O)N[C@@H](Cc1cnc[nH]1)C(=O)N[C@H](Cc1ccccc1)C(=O)N[C@@H](CCCNC(N)=N)C(=O)N[C@@H](Cc1c[nH]c2ccccc12)C(=O)NCC(=O)N[C@@H](CCCCN)C(=O)N1CCC[C@H]1C(=O)N[C@@H](C(C)C)C(N)=O
: