Target
AP2-associated protein kinase 1
Ligand
BDBM50511380
Substrate
Meas. Tech.
ChEMBL_1844756 (CHEMBL4345183)
Ki
10.0±n/a nM
Citation
 Wells, CCouņago, RMLimas, JCAlmeida, TLCook, JGDrewry, DHElkins, JMGileadi, OKapadia, NRLorente-Macias, APickett, JERiemen, ARuela-de-Sousa, RRWillson, TMZhang, CZuercher, WJZutshi, RAxtman, AD SGC-AAK1-1: A Chemical Probe Targeting AAK1 and BMP2K. ACS Med Chem Lett 11:340-345 (2020)  
Target
Name:
AP2-associated protein kinase 1
Synonyms:
AAK1 Adaptor-associated kinase 1 | KIAA1048
Type:
PROTEIN
Mol. Mass.:
103884.23
Organism:
Homo sapiens (Human)
Description:
ChEMBL_774569
Residue:
961
  
Inhibitor
Name:
BDBM50511380
Synonyms:
CHEMBL4452360
Type:
Small organic molecule
Emp. Form.:
C19H21N5O3S
Mol. Mass.:
399.467
SMILES:
CN(C)S(=O)(=O)Nc1cccc(c1)-c1ccc2c(NC(=O)C3CC3)n[nH]c2c1
: