Target
Dihydrofolate reductase
Ligand
BDBM50066496
Substrate
Meas. Tech.
ChEMBL_54386 (CHEMBL666736)
IC50
13±n/a nM
Citation
 Gangjee, AVidwans, APVasudevan, AQueener, SFKisliuk, RLCody, VLi, RGalitsky, NLuft, JRPangborn, W Structure-based design and synthesis of lipophilic 2,4-diamino-6-substituted quinazolines and their evaluation as inhibitors of dihydrofolate reductases and potential antitumor agents. J Med Chem 41:3426-34 (1998)  
Target
Name:
Dihydrofolate reductase
Synonyms:
Dihydrofolate reductase (F31V) | dfrA17
Type:
Mol. Mass.:
17532.46
Organism:
Escherichia coli
Description:
Residue:
157
  
Inhibitor
Name:
BDBM50066496
Synonyms:
CHEMBL115804 | N*6*-(2,4-Dimethoxy-benzyl)-N*6*-methyl-quinazoline-2,4,6-triamine
Type:
Small organic molecule
Emp. Form.:
C18H21N5O2
Mol. Mass.:
339.3916
SMILES:
COc1ccc(CN(C)c2ccc3nc(N)nc(N)c3c2)c(OC)c1
: