Target
Dihydrofolate reductase
Ligand
BDBM50066485
Substrate
Meas. Tech.
ChEMBL_52968 (CHEMBL664176)
IC50
52.0±n/a nM
Citation
 Gangjee, AVidwans, APVasudevan, AQueener, SFKisliuk, RLCody, VLi, RGalitsky, NLuft, JRPangborn, W Structure-based design and synthesis of lipophilic 2,4-diamino-6-substituted quinazolines and their evaluation as inhibitors of dihydrofolate reductases and potential antitumor agents. J Med Chem 41:3426-34 (1998)  
Target
Name:
Dihydrofolate reductase
Synonyms:
DHFR Dihydrofolate reductase (DHFR) | Tetrahydrofolate dehydrogenase
Type:
Enzyme
Mol. Mass.:
21453.99
Organism:
Homo sapiens (Human)
Description:
Recombinant human DHFR.
Residue:
187
  
Inhibitor
Name:
BDBM50066485
Synonyms:
CHEMBL117750 | N*6*-Methyl-N*6*-(2,3,4-trimethoxy-benzyl)-quinazoline-2,4,6-triamine
Type:
Small organic molecule
Emp. Form.:
C19H23N5O3
Mol. Mass.:
369.4176
SMILES:
COc1ccc(CN(C)c2ccc3nc(N)nc(N)c3c2)c(OC)c1OC
: