Target
Dihydrofolate reductase
Ligand
BDBM50066490
Substrate
Meas. Tech.
ChEMBL_54899 (CHEMBL664708)
IC50
130±n/a nM
Citation
 Gangjee, AVidwans, APVasudevan, AQueener, SFKisliuk, RLCody, VLi, RGalitsky, NLuft, JRPangborn, W Structure-based design and synthesis of lipophilic 2,4-diamino-6-substituted quinazolines and their evaluation as inhibitors of dihydrofolate reductases and potential antitumor agents. J Med Chem 41:3426-34 (1998)  
Target
Name:
Dihydrofolate reductase
Synonyms:
DHFR Dihydrofolate reductase (DHFR) | Tetrahydrofolate dehydrogenase
Type:
Enzyme
Mol. Mass.:
21453.99
Organism:
Homo sapiens (Human)
Description:
Recombinant human DHFR.
Residue:
187
  
Inhibitor
Name:
BDBM50066490
Synonyms:
2,4-DIAMINO-6-[N-(2',5'-DIMETHOXYBENZYL)-N-METHYLAMINO]QUINAZOLINE N*6*-(2,5-Dimethoxy-benzyl)-N*6*-methyl-quinazoline-2,4,6-triamine | N6-(2,5-dimethoxybenzyl)-N6-methylquinazoline-2,4,6-triamine
Type:
Small organic molecule
Emp. Form.:
C18H21N5O2
Mol. Mass.:
339.3916
SMILES:
COc1ccc(OC)c(CN(C)c2ccc3nc(N)nc(N)c3c2)c1
: