Target
Procathepsin L
Ligand
BDBM19810
Substrate
Meas. Tech.
ChEMBL_48507 (CHEMBL660656)
Ki
16±n/a nM
Citation
 Marquis, RWYamashita, DSRu, YLoCastro, SMOh, HJErhard, KFDesJarlais, RLHead, MSSmith, WWZhao, BJanson, CAAbdel-Meguid, SSTomaszek, TALevy, MAVeber, DF Conformationally constrained 1,3-diamino ketones: a series of potent inhibitors of the cysteine protease cathepsin K. J Med Chem 41:3563-7 (1998)  
Target
Name:
Procathepsin L
Synonyms:
CATL1_HUMAN CTSL CTSL1 Cathepsin L Cathepsin L1 heavy chain MEP cathepsin L preproprotein
Type:
Enzyme
Mol. Mass.:
37557.19
Organism:
Homo sapiens (Human)
Description:
Purchased from Calbiochem (San Diego, CA).
Residue:
333
  
Inhibitor
Name:
BDBM19810
Synonyms:
CHEMBL118449 piperidinone analogue, 27
Type:
Small organic molecule
Emp. Form.:
C33H44N4O7
Mol. Mass.:
608.7251
SMILES:
CC(C)C[C@H](NC(=O)OCc1ccccc1)C(=O)NC1CCN(CC1=O)C(=O)[C@H](CC(C)C)NC(=O)OCc1ccccc1
: