Target
ATP-citrate synthase
Ligand
BDBM50066676
Substrate
Meas. Tech.
ChEMBL_29508 (CHEMBL643074)
Ki
550±n/a nM
Citation
 Gribble, ADIfe, RJShaw, AMcNair, DNovelli, CEBakewell, SShah, VPDolle, REGroot, PHPearce, NYates, JTew, DBoyd, HAshman, SEggleston, DSHaltiwanger, RCOkafo, G ATP-Citrate lyase as a target for hypolipidemic intervention. 2. Synthesis and evaluation of (3R,5S)-omega-substituted-3-carboxy-3, 5-dihydroxyalkanoic acids and their gamma-lactone prodrugs as inhibitors of the enzyme in vitro and in vivo. J Med Chem 41:3582-95 (1998)  
Target
Name:
ATP-citrate synthase
Synonyms:
ACLY | ACLY_HUMAN
Type:
PROTEIN
Mol. Mass.:
120848.43
Organism:
Homo sapiens (Human)
Description:
ChEMBL_455196
Residue:
1101
  
Inhibitor
Name:
BDBM50066676
Synonyms:
(2S,3R)-2-[(R)-8-(2,4-Dichloro-phenyl)-2-hydroxy-octyl]-2,3-dihydroxy-succinic acid | CHEMBL120008
Type:
Small organic molecule
Emp. Form.:
C18H24Cl2O7
Mol. Mass.:
423.285
SMILES:
O[C@H](CCCCCCc1ccc(Cl)cc1Cl)C[C@](O)([C@@H](O)C(O)=O)C(O)=O
: