Target
Retinoic acid receptor gamma
Ligand
BDBM50066904
Substrate
Meas. Tech.
ChEMBL_195993 (CHEMBL800482)
EC50
330±n/a nM
Citation
 Benbrook, DMSubramanian, SGale, JBLiu, SBrown, CWBoehm, MFBerlin, KD Synthesis and characterization of heteroarotinoids demonstrate structure specificity relationships. J Med Chem 41:3753-7 (1998)  
Target
Name:
Retinoic acid receptor gamma
Synonyms:
NR1B3 RAR-gamma RARG_HUMAN Retinoic acid receptor gamma | Retinoid receptor
Type:
PROTEIN
Mol. Mass.:
50345.43
Organism:
Homo sapiens (Human)
Description:
ChEMBL_1458016
Residue:
454
  
Inhibitor
Name:
BDBM50066904
Synonyms:
4-[(E)-2-(4,4-Dimethyl-chroman-6-yl)-propenyl]-benzoic acid methyl ester CHEMBL34464
Type:
Small organic molecule
Emp. Form.:
C22H24O3
Mol. Mass.:
336.4242
SMILES:
COC(=O)c1ccc(\C=C(/C)c2ccc3OCCC(C)(C)c3c2)cc1
: