Target
Reverse transcriptase/RNaseH
Ligand
BDBM1944
Substrate
Meas. Tech.
ChEMBL_195371 (CHEMBL802409)
IC50
6660±n/a nM
Citation
 Nugent, RASchlachter, STMurphy, MJCleek, GJPoel, TJWishka, DGGraber, DRYagi, YKeiser, BJOlmsted, RAKopta, LASwaney, SMPoppe, SMMorris, JTarpley, WGThomas, RC Pyrimidine thioethers: a novel class of HIV-1 reverse transcriptase inhibitors with activity against BHAP-resistant HIV. J Med Chem 41:3793-803 (1998)  
Target
Name:
Reverse transcriptase/RNaseH
Synonyms:
HIV-1 Reverse Transcriptase RNase H Reverse transcriptase/RNaseH
Type:
PROTEIN
Mol. Mass.:
65229.15
Organism:
Human immunodeficiency virus 1
Description:
ChEMBL_1473730
Residue:
566
  
Inhibitor
Name:
BDBM1944
Synonyms:
BHAP deriv. DELAVIRDINE MESYLATE N-[2-({4-[3-(propan-2-ylamino)pyridin-2-yl]piperazin-1-yl}carbonyl)-1H-indol-5-yl]methanesulfonamide U-90152S
Type:
Small organic molecule
Emp. Form.:
C22H28N6O3S
Mol. Mass.:
456.561
SMILES:
CC(C)Nc1cccnc1N1CCN(CC1)C(=O)c1cc2cc(NS(C)(=O)=O)ccc2[nH]1
: