Target
L-lactate dehydrogenase A chain
Ligand
BDBM50066975
Substrate
Meas. Tech.
ChEMBL_96428 (CHEMBL706376)
Ki
700±n/a nM
Citation
 Deck, LMRoyer, REChamblee, BBHernandez, VMMalone, RRTorres, JEHunsaker, LAPiper, RCMakler, MTVander Jagt, DL Selective inhibitors of human lactate dehydrogenases and lactate dehydrogenase from the malarial parasite Plasmodium falciparum. J Med Chem 41:3879-87 (1998)  
Target
Name:
L-lactate dehydrogenase A chain
Synonyms:
Cell proliferation-inducing gene 19 protein L-lactate dehydrogenase A Chain LDH-A LDHA Lactate dehydrogenase A (LDHA) | Renal carcinoma antigen NY-REN-59
Type:
Protein
Mol. Mass.:
36694.85
Organism:
Homo sapiens (Human)
Description:
P00338::PDB Code: 4ajp
Residue:
332
  
Inhibitor
Name:
BDBM50066975
Synonyms:
7-Benzyl-2,3-dihydroxy-4-isopropyl-6-methyl-naphthalene-1-carboxylic acid | CHEMBL341463
Type:
Small organic molecule
Emp. Form.:
C22H22O4
Mol. Mass.:
350.4077
SMILES:
CC(C)c1c(O)c(O)c(C(O)=O)c2cc(Cc3ccccc3)c(C)cc12
: