Target
L-lactate dehydrogenase B chain
Ligand
BDBM50066979
Substrate
Meas. Tech.
ChEMBL_96432 (CHEMBL706379)
Ki
19000±n/a nM
Citation
 Deck, LMRoyer, REChamblee, BBHernandez, VMMalone, RRTorres, JEHunsaker, LAPiper, RCMakler, MTVander Jagt, DL Selective inhibitors of human lactate dehydrogenases and lactate dehydrogenase from the malarial parasite Plasmodium falciparum. J Med Chem 41:3879-87 (1998)  
Target
Name:
L-lactate dehydrogenase B chain
Synonyms:
L-lactate dehydrogenase B LDH heart subunit LDH-H LDHB_HUMAN Renal carcinoma antigen NY-REN-46
Type:
Oxidoreductase; homotetramer
Mol. Mass.:
36635.55
Organism:
Homo sapiens (Human)
Description:
Residue:
334
  
Inhibitor
Name:
BDBM50066979
Synonyms:
2,3-Dihydroxy-6,7-dimethyl-4-propyl-naphthalene-1-carboxylic acid | CHEMBL338325
Type:
Small organic molecule
Emp. Form.:
C16H18O4
Mol. Mass.:
274.3117
SMILES:
CCCc1c(O)c(O)c(C(O)=O)c2cc(C)c(C)cc12
: