Target
Insulin receptor
Ligand
BDBM50066982
Substrate
Meas. Tech.
ChEMBL_90265 (CHEMBL699130)
IC50
6700±n/a nM
Citation
 Copp, BRFairchild, CRCornell, LCasazza, AMRobinson, SIreland, CM Naamidine A is an antagonist of the epidermal growth factor receptor and an in vivo active antitumor agent. J Med Chem 41:3909-11 (1998)  
Target
Name:
Insulin receptor
Synonyms:
CD_antigen=CD220 IR Insulin receptor subunit alpha | Insulin receptor subunit beta
Type:
PROTEIN
Mol. Mass.:
155593.32
Organism:
Mus musculus
Description:
ChEMBL_305383
Residue:
1372
  
Inhibitor
Name:
BDBM50066982
Synonyms:
5-[1,4-Bis-(4-methoxy-benzyl)-1H-imidazol-2-ylamino]-3-methyl-imidazole-2,4-dione | CHEMBL340520
Type:
Small organic molecule
Emp. Form.:
C23H23N5O4
Mol. Mass.:
433.4598
SMILES:
COc1ccc(Cc2cn(Cc3ccc(OC)cc3)c(NC3=NC(=O)N(C)C3=O)n2)cc1
: