Target
GABA-A receptor; alpha-5/beta-3/gamma-2
Ligand
BDBM26267
Substrate
Meas. Tech.
ChEMBL_70702 (CHEMBL685338)
Ki
0.27±n/a nM
Citation
 Huang, QLiu, RZhang, PHe, XMcKernan, RGan, TBennett, DWCook, JM Predictive models for GABAA/benzodiazepine receptor subtypes: studies of quantitative structure-activity relationships for imidazobenzodiazepines at five recombinant GABAA/benzodiazepine receptor subtypes [alphaxbeta3gamma2 (x = 1-3, 5, and 6)] via comparative molecular field analysis. J Med Chem 41:4130-42 (1998)  
Target
Name:
GABA-A receptor; alpha-5/beta-3/gamma-2
Synonyms:
GABA receptor alpha-5/beta-3/gamma-2 subunit | Gamma-aminobutyric acid receptor subunit alpha-5/beta-3/gamma-2
Type:
Mol. Mass.:
Description:
ASSAY_ID of ChEMBL is 2148177
Components:
This complex has 3 components.
Component 1
Name:
Gamma-aminobutyric acid receptor subunit gamma-2
Synonyms:
GABA(A) receptor subunit gamma-2 GBRG2_HUMAN
Type:
PROTEIN
Mol. Mass.:
54172.74
Organism:
Homo sapiens (Human)
Description:
EBI_217
Residue:
467
  
Component 2
Name:
Gamma-aminobutyric acid receptor subunit beta-3
Synonyms:
GABA A receptor alpha-4/beta-3/gamma-2 GABA-A receptor GBRB3_HUMAN | agonist GABA site
Type:
PROTEIN
Mol. Mass.:
54130.51
Organism:
Homo sapiens (Human)
Description:
ChEMBL_448071
Residue:
473
  
Component 3
Name:
Gamma-aminobutyric acid receptor subunit alpha-5
Synonyms:
GABA receptor alpha-5 subunit GABRA5 Gamma-aminobutyric acid receptor subunit alpha-5 (GABA(A)) | Gamma-aminobutyric acid receptor subunit alpha-5 (GABAA)
Type:
Enzyme
Mol. Mass.:
52160.59
Organism:
Homo sapiens (Human)
Description:
P31644
Residue:
462
  
Inhibitor
Name:
BDBM26267
Synonyms:
RO-154513 [3H]Ro15-4513 | ethyl 12-azido-8-methyl-9-oxo-2,4,8-triazatricyclo[8.4.0.0^{2,6}]tetradeca-1(10),3,5,11,13-pentaene-5-carboxylate
Type:
radiolabeled ligand
Emp. Form.:
C15H14N6O3
Mol. Mass.:
326.3101
SMILES:
CCOC(=O)c1ncn-2c1CN(C)C(=O)c1cc(ccc-21)N=[N+]=[N-]
: